Target
Beta-secretase 2
Ligand
BDBM50303719
Substrate
Meas. Tech.
ChEMBL_612753 (CHEMBL1071579)
IC50
790±n/a nM
Citation
 Malamas, MSBarnes, KJohnson, MHui, YZhou, PTurner, JHu, YWagner, EFan, KChopra, ROlland, ABard, JPangalos, MReinhart, PRobichaud, AJ Di-substituted pyridinyl aminohydantoins as potent and highly selective human beta-secretase (BACE1) inhibitors. Bioorg Med Chem 18:630-9 (2010)  
Target
Name:
Beta-secretase 2
Synonyms:
AEPLC ASP1 Asp 1 Aspartyl protease 1 BACE2_HUMAN Beta-secretase (BACE) Beta-secretase 2 (BACE-2) Beta-site APP-cleaving enzyme 2 Memapsin-1 beta-Secretase (BACE-2)
Type:
Protein
Mol. Mass.:
56171.20
Organism:
Homo sapiens (Human)
Description:
Q9Y5Z0
Residue:
518
  
Inhibitor
Name:
BDBM50303719
Synonyms:
2-amino-4-(4-methoxy-3-methylphenyl)-1-methyl-4-(3-(pyridin-3-yl)phenyl)-1H-imidazol-5(4H)-one rac-2-amino-4-(4-methoxy-3-methylphenyl)-1-methyl-4-(3-(pyridin-3-yl)phenyl)-1H-imidazol-5(4H)-one
Type:
Small organic molecule
Emp. Form.:
C23H22N4O2
Mol. Mass.:
386.4464
SMILES:
COc1ccc(cc1C)C1(N=C(N)N(C)C1=O)c1cccc(c1)-c1cccnc1
: