Target
Thymidylate synthase
Ligand
BDBM50091145
Substrate
Meas. Tech.
ChEMBL_608250 (CHEMBL1073053)
pH
7.4±n/a
IC50
>200000±n/a nM
Comments
extracted
Citation
 Gangjee, AJain, HDPhan, JGuo, XQueener, SFKisliuk, RL 2,4-Diamino-5-methyl-6-substituted arylthio-furo[2,3-d]pyrimidines as novel classical and nonclassical antifolates as potential dual thymidylate synthase and dihydrofolate reductase inhibitors. Bioorg Med Chem 18:953-61 (2010)  
Target
Name:
Thymidylate synthase
Synonyms:
TS TYMS Thymidylate synthase (TS) | Thymidylate synthase/GAR transformylase/AICAR transformylase
Type:
Enzyme
Mol. Mass.:
35718.07
Organism:
Homo sapiens (Human)
Description:
Residue:
313
  
Inhibitor
Name:
BDBM50091145
Synonyms:
(S)-2-(4-(((2,4-diaminofuro[2,3-d]pyrimidin-5-yl)methyl)(methyl)amino)benzamido)pentanedioic acid CHEMBL104829 N-[4-[(2,4-DIAMINOFURO[2,3D]PYRIMIDIN-5-YL)METHYL]METHYLAMINO]-BENZOYL]-L-GLUTAMATE
Type:
Small organic molecule
Emp. Form.:
C20H22N6O6
Mol. Mass.:
442.4253
SMILES:
CN(Cc1coc2nc(N)nc(N)c12)c1ccc(cc1)C(=O)N[C@@H](CCC(O)=O)C(O)=O
: