Target
Mitogen-activated protein kinase 9
Ligand
BDBM50310972
Substrate
Meas. Tech.
ChEMBL_618898 (CHEMBL1101789)
IC50
>200000±n/a nM
Citation
 Selness, SRDevraj, RVMonahan, JBBoehm, TLWalker, JKDevadas, BDurley, RCKurumbail, RShieh, HXing, LHepperle, MRucker, PVJerome, KDBenson, AGMarrufo, LDMadsen, HMHitchcock, JOwen, TJChristie, LPromo, MAHickory, BSAlvira, ENaing, WBlevis-Bal, R Discovery of N-substituted pyridinones as potent and selective inhibitors of p38 kinase. Bioorg Med Chem Lett 19:5851-6 (2009)  
Target
Name:
Mitogen-activated protein kinase 9
Synonyms:
JNK-55 JNK2/JNK3 MK09_HUMAN Mitogen-activated protein kinase 8/9 SAPK1A c-Jun N-terminal kinase 2 | c-Jun N-terminal kinase 2 (JNK2)
Type:
Enzyme
Mol. Mass.:
48131.49
Organism:
Homo sapiens (Human)
Description:
JNK-2 was purchased from Upstate Cell Signaling Solutions (formerly Upstate Biotechnology).
Residue:
424
  
Inhibitor
Name:
BDBM50310972
Synonyms:
3-bromo-4-(4-fluorobenzyloxy)-6-methyl-1-(pyridin-2-yl)pyridin-2(1H)-one | CHEMBL1080219
Type:
Small organic molecule
Emp. Form.:
C18H14BrFN2O2
Mol. Mass.:
389.218
SMILES:
Cc1cc(OCc2ccc(F)cc2)c(Br)c(=O)n1-c1ccccn1
: