Target
Tyrosine-protein phosphatase non-receptor type 1
Ligand
BDBM50104694
Substrate
Meas. Tech.
ChEMBL_618616 (CHEMBL1101504)
IC50
4500±n/a nM
Citation
 Nguyen, PHLe, TVThuong, PTDao, TTNdinteh, DTMbafor, JTKang, KWOh, WK Cytotoxic and PTP1B inhibitory activities from Erythrina abyssinica. Bioorg Med Chem Lett 19:6745-9 (2009)  
Target
Name:
Tyrosine-protein phosphatase non-receptor type 1
Synonyms:
PTN1_HUMAN PTPN1 Protein tyrosine phosphatase-1B (PTP1B) Protein-tyrosine phosphatase 1B (PTP1B) Tyrosine-protein phosphatase non-receptor type 1 (PTP1B)
Type:
Protein phosphatase
Mol. Mass.:
49963.76
Organism:
Homo sapiens (Human)
Description:
Human recombinant GST-fusion PTP1B (1-435).
Residue:
435
  
Inhibitor
Name:
BDBM50104694
Synonyms:
(R)-4-hydroxy-5-(hydroxymethyl)-3-palmitoylfuran-2(5H)-one 3-Hexadecanoyl-4-hydroxy-5-hydroxymethyl-5H-furan-2-one RK-682
Type:
Small organic molecule
Emp. Form.:
C21H36O5
Mol. Mass.:
368.5075
SMILES:
CCCCCCCCCCCCCCCC(=O)c1c(O)oc(CO)c1O
: