Target
Tyrosine-protein phosphatase non-receptor type 1
Ligand
BDBM50311578
Substrate
Meas. Tech.
ChEMBL_618616 (CHEMBL1101504)
IC50
19500±n/a nM
Citation
 Nguyen, PHLe, TVThuong, PTDao, TTNdinteh, DTMbafor, JTKang, KWOh, WK Cytotoxic and PTP1B inhibitory activities from Erythrina abyssinica. Bioorg Med Chem Lett 19:6745-9 (2009)  
Target
Name:
Tyrosine-protein phosphatase non-receptor type 1
Synonyms:
PTN1_HUMAN PTPN1 Protein tyrosine phosphatase-1B (PTP1B) Protein-tyrosine phosphatase 1B (PTP1B) Tyrosine-protein phosphatase non-receptor type 1 (PTP1B)
Type:
Protein phosphatase
Mol. Mass.:
49963.76
Organism:
Homo sapiens (Human)
Description:
Human recombinant GST-fusion PTP1B (1-435).
Residue:
435
  
Inhibitor
Name:
BDBM50311578
Synonyms:
3,9-Dihydroxy-4-prenyl-[6aR;11aR]pterocarpan | CHEMBL1087027
Type:
Small organic molecule
Emp. Form.:
C20H20O4
Mol. Mass.:
324.3704
SMILES:
[#6]\[#6](-[#6])=[#6]\[#6]-c1c(-[#8])ccc2-[#6@@H]-3-[#8]-c4cc(-[#8])ccc4-[#6@@H]-3-[#6]-[#8]-c12
: