Target
Progesterone receptor
Ligand
BDBM50312006
Substrate
Meas. Tech.
ChEMBL_620573 (CHEMBL1111206)
IC50
57.3±n/a nM
Citation
 Roll, DMBarbieri, LRBigelis, RMcDonald, LAArias, DAChang, LPSingh, MPLuckman, SWBerrodin, TJYudt, MR The lecanindoles, nonsteroidal progestins from the terrestrial fungus Verticillium lecanii 6144. J Nat Prod 72:1944-8 (2009)  
Target
Name:
Progesterone receptor
Synonyms:
NR3C3 PGR PRGR_HUMAN | progesterone
Type:
Protein
Mol. Mass.:
98979.52
Organism:
Homo sapiens (Human)
Description:
P06401
Residue:
933
  
Inhibitor
Name:
BDBM50312006
Synonyms:
CHEMBL1076438 | Lecanindole D
Type:
Small organic molecule
Emp. Form.:
C23H31NO2
Mol. Mass.:
353.4977
SMILES:
C[C@@]12[C@H](Cc3c1[nH]c1ccccc31)CC[C@@]1(O)C(C)(C)[C@H](O)CC[C@]21C
: