Target
Interleukin-1 receptor-associated kinase 4
Ligand
BDBM50313051
Substrate
Meas. Tech.
ChEMBL_616302 (CHEMBL1102105)
Ki
1500±n/a nM
Citation
 Arnost, MPierce, Ater Haar, ELauffer, DMadden, JTanner, KGreen, J 3-Aryl-4-(arylhydrazono)-1H-pyrazol-5-ones: Highly ligand efficient and potent inhibitors of GSK3beta. Bioorg Med Chem Lett 20:1661-4 (2010)  
Target
Name:
Interleukin-1 receptor-associated kinase 4
Synonyms:
IRAK-4 IRAK4_HUMAN Interleukin-1 receptor-associated kinase 4 (IRAK4) | Renal carcinoma antigen NY-REN-64
Type:
Protein
Mol. Mass.:
51519.08
Organism:
Homo sapiens (Human)
Description:
Q9NWZ3
Residue:
460
  
Inhibitor
Name:
BDBM50313051
Synonyms:
(Z)-3-(4-methoxyphenyl)-4-(2-(pyridin-3-yl)hydrazono)-1H-pyrazol-5(4H)-one | CHEMBL1076721
Type:
Small organic molecule
Emp. Form.:
C15H13N5O2
Mol. Mass.:
295.296
SMILES:
COc1ccc(cc1)-c1[nH][nH]c(=O)c1N=Nc1cccnc1
: