Target
Glycogen synthase kinase-3 beta
Ligand
BDBM50313022
Substrate
Meas. Tech.
ChEMBL_616299 (CHEMBL1102102)
Ki
850±n/a nM
Citation
 Arnost, MPierce, Ater Haar, ELauffer, DMadden, JTanner, KGreen, J 3-Aryl-4-(arylhydrazono)-1H-pyrazol-5-ones: Highly ligand efficient and potent inhibitors of GSK3beta. Bioorg Med Chem Lett 20:1661-4 (2010)  
Target
Name:
Glycogen synthase kinase-3 beta
Synonyms:
GSK-3 beta GSK3B Glycogen synthase kinase 3 beta (GSK3B) Glycogen synthase kinase-3 beta (GSK-3B) Glycogen synthase kinase-3 beta (GSK3B) Glycogen synthase kinase-3beta (GSK3B) | Serine/threonine-protein kinase GSK3B
Type:
Enzyme
Mol. Mass.:
46756.38
Organism:
Homo sapiens (Human)
Description:
P49841
Residue:
420
  
Inhibitor
Name:
BDBM50313022
Synonyms:
(Z)-4-(2-(2-chlorophenyl)hydrazono)-3-(3-methoxyphenyl)-1H-pyrazol-5(4H)-one | CHEMBL1081063
Type:
Small organic molecule
Emp. Form.:
C16H13ClN4O2
Mol. Mass.:
328.753
SMILES:
COc1cccc(c1)-c1[nH][nH]c(=O)c1N=Nc1ccccc1Cl
: