Target
Glycogen synthase kinase-3 beta
Ligand
BDBM50313034
Substrate
Meas. Tech.
ChEMBL_616299 (CHEMBL1102102)
Ki
2±n/a nM
Citation
 Arnost, MPierce, Ater Haar, ELauffer, DMadden, JTanner, KGreen, J 3-Aryl-4-(arylhydrazono)-1H-pyrazol-5-ones: Highly ligand efficient and potent inhibitors of GSK3beta. Bioorg Med Chem Lett 20:1661-4 (2010)  
Target
Name:
Glycogen synthase kinase-3 beta
Synonyms:
GSK-3 beta GSK3B Glycogen synthase kinase 3 beta (GSK3B) Glycogen synthase kinase-3 beta (GSK-3B) Glycogen synthase kinase-3 beta (GSK3B) Glycogen synthase kinase-3beta (GSK3B) | Serine/threonine-protein kinase GSK3B
Type:
Enzyme
Mol. Mass.:
46756.38
Organism:
Homo sapiens (Human)
Description:
P49841
Residue:
420
  
Inhibitor
Name:
BDBM50313034
Synonyms:
(Z)-3-(4-methoxyphenyl)-4-(2-(4-methoxyphenyl)hydrazono)-1H-pyrazol-5(4H)-one | CHEMBL1081633
Type:
Small organic molecule
Emp. Form.:
C17H16N4O3
Mol. Mass.:
324.3339
SMILES:
COc1ccc(cc1)N=Nc1c([nH][nH]c1=O)-c1ccc(OC)cc1
: