Target
Beta-1 adrenergic receptor
Ligand
BDBM50313960
Substrate
Meas. Tech.
ChEMBL_615506 (CHEMBL1105984)
IC50
>20000±n/a nM
Citation
 Goble, SDWang, LHowell, KLBansal, ABerger, RBrockunier, LDiSalvo, JFeighner, SHarper, BHe, JHurley, AHreniuk, DParmee, ERobbins, MSalituro, GSanfiz, AStreckfuss, EWatkins, EWeber, AEStruthers, MEdmondson, SD Heterocyclic acetamide and benzamide derivatives as potent and selective beta3-adrenergic receptor agonists with improved rodent pharmacokinetic profiles. Bioorg Med Chem Lett 20:1895-9 (2010)  
Target
Name:
Beta-1 adrenergic receptor
Synonyms:
ADRB1 ADRB1_HUMAN Beta-1 adrenoceptor | adrenergic Beta1
Type:
G Protein-Coupled Receptor (GPCR)
Mol. Mass.:
51338.40
Organism:
Homo sapiens (Human)
Description:
P08588
Residue:
477
  
Inhibitor
Name:
BDBM50313960
Synonyms:
(R)-N-(4-(2-(2-hydroxy-2-(pyridin-3-yl)ethylamino)ethyl)phenyl)-2-(pyrrolidin-1-yl)benzamide | CHEMBL1089735
Type:
Small organic molecule
Emp. Form.:
C26H30N4O2
Mol. Mass.:
430.542
SMILES:
O[C@@H](CNCCc1ccc(NC(=O)c2ccccc2N2CCCC2)cc1)c1cccnc1
: