Target
Adenosine receptor A1
Ligand
BDBM50315545
Substrate
Meas. Tech.
ChEMBL_627305 (CHEMBL1105451)
Ki
0.19±n/a nM
Citation
 Mishra, CBBarodia, SKPrakash, ASenthil Kumar, JBLuthra, PM Novel 8-(furan-2-yl)-3-substituted thiazolo [5,4-e][1,2,4] triazolo[1,5-c] pyrimidine-2(3H)-thione derivatives as potential adenosine A(2A) receptor antagonists. Bioorg Med Chem 18:2491-500 (2010)  
Target
Name:
Adenosine receptor A1
Synonyms:
A1 adenosine receptor (hA1) AA1R_HUMAN ADORA1 Adenosine A1-receptor Adenosine receptor A1 (hA1) | Adenosine transporter (AdT)
Type:
G Protein-Coupled Receptor (GPCR)
Mol. Mass.:
36520.92
Organism:
Homo sapiens (Human)
Description:
P30542
Residue:
326
  
Inhibitor
Name:
BDBM50315545
Synonyms:
8-(2-Thioxo-7(3-m-chlorophenyl)-2-(2-furyl)thiazolo[4,3-e]1,2,4-triazolo[1,5-c]pyrimidine | CHEMBL1090578
Type:
Small organic molecule
Emp. Form.:
C16H8ClN5OS2
Mol. Mass.:
385.851
SMILES:
Clc1cccc(c1)-n1c2ncn3nc(nc3c2sc1=S)-c1ccco1
: