Target
Transient receptor potential cation channel subfamily V member 1
Ligand
BDBM20557
Substrate
Meas. Tech.
ChEMBL_627603 (CHEMBL1113609)
IC50
0.9±n/a nM
Citation
 Blum, CACaldwell, TZheng, XBakthavatchalam, RCapitosti, SBrielmann, HDe Lombaert, SKershaw, MTMatson, DKrause, JECortright, DCrandall, MMartin, WJMurphy, BABoyce, SJones, ABMason, GRycroft, WPerrett, HConley, RBurnaby-Davies, NChenard, BLHodgetts, KJ Discovery of novel 6,6-heterocycles as transient receptor potential vanilloid (TRPV1) antagonists. J Med Chem 53:3330-48 (2010)  
Target
Name:
Transient receptor potential cation channel subfamily V member 1
Synonyms:
Capsaicin receptor Osm-9-like TRP channel 1 TRPV1_HUMAN Transient receptor potential cation channel subfamily V member 1 (TRPV1) Transient receptor potential cation channel subfamily V member 1(TRPV1) Vanilloid VR1 Vanilloid receptor 1 Vanilloid receptor 1 (VRI/TRPV1)
Type:
Protein
Mol. Mass.:
94960.75
Organism:
Homo sapiens (Human)
Description:
Q8NER1
Residue:
839
  
Inhibitor
Name:
BDBM20557
Synonyms:
AMG 517 JMC503515 Compound 23 US8796328, A | US8802711, H
Type:
Small organic molecule
Emp. Form.:
C20H13F3N4O2S
Mol. Mass.:
430.403
SMILES:
CC(=O)Nc1nc2c(Oc3cc(ncn3)-c3ccc(cc3)C(F)(F)F)cccc2s1
: