Target
Melanocortin receptor 4
Ligand
BDBM50315698
Substrate
Meas. Tech.
ChEMBL_624014 (CHEMBL1108859)
EC50
962±n/a nM
Citation
 Lansdell, MIHepworth, DCalabrese, ABrown, ADBlagg, JBurring, DJWilson, PFradet, DBrown, TBQuinton, FMistry, NTang, KMount, NStacey, PEdmunds, NAdams, CGaboardi, SNeal-Morgan, SWayman, CCole, SPhipps, JLewis, MVerrier, HGillon, VFeeder, NHeatherington, ASultana, SHaughie, SMartin, SWSudworth, MTweedy, S Discovery of a selective small-molecule melanocortin-4 receptor agonist with efficacy in a pilot study of sexual dysfunction in humans. J Med Chem 53:3183-97 (2010)  
Target
Name:
Melanocortin receptor 4
Synonyms:
MC4-R MC4R_HUMAN Melanocortin receptor 4 (MC-4) Melanocortin receptor 4 (MC4R)
Type:
Enzyme
Mol. Mass.:
36949.50
Organism:
Homo sapiens (Human)
Description:
P32245
Residue:
332
  
Inhibitor
Name:
BDBM50315698
Synonyms:
((3S,4R)-1-tert-butyl-4-(2,4-difluorophenyl)pyrrolidin-3-yl)((3S,4R,5R)-4-cyclopropyl-4-hydroxy-3,5-dimethylpiperidin-1-yl)methanone | CHEMBL1093855
Type:
Small organic molecule
Emp. Form.:
C25H36F2N2O2
Mol. Mass.:
434.5623
SMILES:
C[C@H]1CN(C[C@@H](C)[C@]1(O)C1CC1)C(=O)[C@@H]1CN(C[C@H]1c1ccc(F)cc1F)C(C)(C)C
: