Target
Melanocortin receptor 4
Ligand
BDBM50315711
Substrate
Meas. Tech.
ChEMBL_624014 (CHEMBL1108859)
EC50
374±n/a nM
Citation
 Lansdell, MIHepworth, DCalabrese, ABrown, ADBlagg, JBurring, DJWilson, PFradet, DBrown, TBQuinton, FMistry, NTang, KMount, NStacey, PEdmunds, NAdams, CGaboardi, SNeal-Morgan, SWayman, CCole, SPhipps, JLewis, MVerrier, HGillon, VFeeder, NHeatherington, ASultana, SHaughie, SMartin, SWSudworth, MTweedy, S Discovery of a selective small-molecule melanocortin-4 receptor agonist with efficacy in a pilot study of sexual dysfunction in humans. J Med Chem 53:3183-97 (2010)  
Target
Name:
Melanocortin receptor 4
Synonyms:
MC4-R MC4R_HUMAN Melanocortin receptor 4 (MC-4) Melanocortin receptor 4 (MC4R)
Type:
Enzyme
Mol. Mass.:
36949.50
Organism:
Homo sapiens (Human)
Description:
P32245
Residue:
332
  
Inhibitor
Name:
BDBM50315711
Synonyms:
((3R,4S)-4-(2,4-difluorophenyl)-1-(2-methoxyethyl)pyrrolidin-3-yl)((3S,4S,5R)-4-hydroxy-3,5-dimethyl-4-phenylpiperidin-1-yl)methanone | CHEMBL1092572
Type:
Small organic molecule
Emp. Form.:
C27H34F2N2O3
Mol. Mass.:
472.5673
SMILES:
COCCN1C[C@@H]([C@H](C1)c1ccc(F)cc1F)C(=O)N1C[C@H](C)[C@](O)([C@H](C)C1)c1ccccc1
: