Target
Aurora kinase B
Ligand
BDBM50378774
Substrate
Meas. Tech.
ChEMBL_630516 (CHEMBL1104788)
IC50
97±n/a nM
Citation
Target
Name:
Aurora kinase B
Synonyms:
AIK2 AIM1 ARK2 AURKB_HUMAN Aurora B-INCENP Aurora kinase B (AURKB) STK-1 STK12 Serine/threonine-protein kinase aurora B
Type:
Protein
Mol. Mass.:
39327.72
Organism:
Homo sapiens (Human)
Description:
Q96GD4
Residue:
344
  
Inhibitor
Name:
BDBM50378774
Synonyms:
CHEMBL1964276
Type:
Small organic molecule
Emp. Form.:
C28H26N6O2
Mol. Mass.:
478.545
SMILES:
O=C(Nc1ccccc1)Nc1ccc(cc1)-c1nn(CC2CCCO2)cc1-c1ccnc2[nH]ccc12
: