Target
Aurora kinase B
Ligand
BDBM50316495
Substrate
Meas. Tech.
ChEMBL_630516 (CHEMBL1104788)
IC50
16±n/a nM
Citation
Target
Name:
Aurora kinase B
Synonyms:
AIK2 AIM1 ARK2 AURKB_HUMAN Aurora B-INCENP Aurora kinase B (AURKB) STK-1 STK12 Serine/threonine-protein kinase aurora B
Type:
Protein
Mol. Mass.:
39327.72
Organism:
Homo sapiens (Human)
Description:
Q96GD4
Residue:
344
  
Inhibitor
Name:
BDBM50316495
Synonyms:
CHEMBL1095817 | N-Phenyl-N'-{4-[4-(1H-pyrrolo[2,3-b]pyridin-4-yl)-1-(2,2,2-trifluoroethyl)-1H-pyrazol-3-yl]phenyl}urea
Type:
Small organic molecule
Emp. Form.:
C25H19F3N6O
Mol. Mass.:
476.4532
SMILES:
FC(F)(F)Cn1cc(c(n1)-c1ccc(NC(=O)Nc2ccccc2)cc1)-c1ccnc2[nH]ccc12
: