Target
Aurora kinase B
Ligand
BDBM50316502
Substrate
Meas. Tech.
ChEMBL_630516 (CHEMBL1104788)
IC50
85±n/a nM
Citation
Target
Name:
Aurora kinase B
Synonyms:
AIK2 AIM1 ARK2 AURKB_HUMAN Aurora B-INCENP Aurora kinase B (AURKB) STK-1 STK12 Serine/threonine-protein kinase aurora B
Type:
Protein
Mol. Mass.:
39327.72
Organism:
Homo sapiens (Human)
Description:
Q96GD4
Residue:
344
  
Inhibitor
Name:
BDBM50316502
Synonyms:
CHEMBL1094507 | N-{4-[1-[2-(4-Morpholinyl)-2-oxoethyl]-4-(1H-pyrrolo[2,3-b]-pyridin-4-yl)-1H-pyrazol-3-yl]phenyl}-N'-phenylurea
Type:
Small organic molecule
Emp. Form.:
C29H27N7O3
Mol. Mass.:
521.5698
SMILES:
O=C(Nc1ccccc1)Nc1ccc(cc1)-c1nn(CC(=O)N2CCOCC2)cc1-c1ccnc2[nH]ccc12
: