Target
Aurora kinase A
Ligand
BDBM50316487
Substrate
Meas. Tech.
ChEMBL_630519 (CHEMBL1104791)
IC50
579±n/a nM
Citation
Target
Name:
Aurora kinase A
Synonyms:
AIK ARK1 AURKA AYK1 Aurora kinase A (AURA) Aurora kinase A (Aurora A) Aurora-related kinase 1 BTAK Breast-tumor-amplified kinase STK15 Serine/threonine kinase 15 Serine/threonine-protein kinase aurora A hARK1
Type:
Serine/threonine-protein kinase
Mol. Mass.:
45830.98
Organism:
Homo sapiens (Human)
Description:
O14965
Residue:
403
  
Inhibitor
Name:
BDBM50316487
Synonyms:
CHEMBL1096492 | N-(4-{1-Ethyl-4-[2-({[2-(methylsulfonyl)ethyl]amino}methyl)-1H-pyrrolo[2,3-b]pyridin-4-yl]-1H-pyrazol-3-yl}phenyl)-N'-phenylurea
Type:
Small organic molecule
Emp. Form.:
C29H31N7O3S
Mol. Mass.:
557.667
SMILES:
CCn1cc(c(n1)-c1ccc(NC(=O)Nc2ccccc2)cc1)-c1ccnc2[nH]c(CNCCS(C)(=O)=O)cc12
: