Target
Aurora kinase A
Ligand
BDBM50315772
Substrate
Meas. Tech.
ChEMBL_630519 (CHEMBL1104791)
IC50
>10000±n/a nM
Citation
Target
Name:
Aurora kinase A
Synonyms:
AIK ARK1 AURKA AYK1 Aurora kinase A (AURA) Aurora kinase A (Aurora A) Aurora-related kinase 1 BTAK Breast-tumor-amplified kinase STK15 Serine/threonine kinase 15 Serine/threonine-protein kinase aurora A hARK1
Type:
Serine/threonine-protein kinase
Mol. Mass.:
45830.98
Organism:
Homo sapiens (Human)
Description:
O14965
Residue:
403
  
Inhibitor
Name:
BDBM50315772
Synonyms:
3-(4-(1-ethyl-4-(1H-pyrrolo[2,3-b]pyridin-4-yl)-1H-pyrazol-3-yl)phenyl)-1,1-dimethylurea N'-{4-[1-Ethyl-4-(1H-pyrrolo[2,3-b]pyridin-4-yl)-1H-pyrazol-3-yl]phenyl}-N,N-dimethylurea
Type:
Small organic molecule
Emp. Form.:
C21H22N6O
Mol. Mass.:
374.439
SMILES:
CCn1cc(c(n1)-c1ccc(NC(=O)N(C)C)cc1)-c1ccnc2[nH]ccc12
: