Target
Aurora kinase A
Ligand
BDBM50316508
Substrate
Meas. Tech.
ChEMBL_630519 (CHEMBL1104791)
IC50
42±n/a nM
Citation
Target
Name:
Aurora kinase A
Synonyms:
AIK ARK1 AURKA AYK1 Aurora kinase A (AURA) Aurora kinase A (Aurora A) Aurora-related kinase 1 BTAK Breast-tumor-amplified kinase STK15 Serine/threonine kinase 15 Serine/threonine-protein kinase aurora A hARK1
Type:
Serine/threonine-protein kinase
Mol. Mass.:
45830.98
Organism:
Homo sapiens (Human)
Description:
O14965
Residue:
403
  
Inhibitor
Name:
BDBM50316508
Synonyms:
4-[3-(4-N-Phenylcarbamylaminophenyl)-1-ethyl-1H-pyrazol-4-yl]-2-[4-(dimethylaminomethyl)-6-methyl-phenyl]-1H-pyrrolo-[2,3-b]pyridine | CHEMBL1099348
Type:
Small organic molecule
Emp. Form.:
C35H35N7O
Mol. Mass.:
569.6987
SMILES:
CCn1cc(c(n1)-c1ccc(NC(=O)Nc2ccccc2)cc1)-c1ccnc2[nH]c(cc12)-c1ccc(CN(C)C)cc1C
: