Target
Bcl-2-like protein 1
Ligand
BDBM50316671
Substrate
Meas. Tech.
ChEMBL_632207 (CHEMBL1106540)
Kd
2000±n/a nM
Citation
 Wei, JStebbins, JLKitada, SDash, RPlaczek, WRega, MFWu, BCellitti, JZhai, DYang, LDahl, RFisher, PBReed, JCPellecchia, M BI-97C1, an optically pure Apogossypol derivative as pan-active inhibitor of antiapoptotic B-cell lymphoma/leukemia-2 (Bcl-2) family proteins. J Med Chem 53:4166-76 (2010)  
Target
Name:
Bcl-2-like protein 1
Synonyms:
Anti-apoptotic Bcl-2 protein Apoptosis regulator Bcl-X BCL2-like 1 isoform 1 BCL2L1 Bcl-2-like protein 1 (Bcl-XL) Bcl-xL/Bcl-2-binding component 3 Bcl2-antagonist of cell death (BAD)
Type:
Mitochondrion membrane; Single-pass membrane protein
Mol. Mass.:
26039.60
Organism:
Homo sapiens (Human)
Description:
Residue:
233
  
Inhibitor
Name:
BDBM50316671
Synonyms:
(S)-1,(R)-1,1',6,6',7,7'-Hexahydroxy-3,3'-dimethyl-N5-((S)-2-phenylpropyl)-N5'-((S)-2-phenylpropyl)-2,2'-binaphthyl-5,5'-dicarboxamide
Type:
Small organic molecule
Emp. Form.:
C42H40N2O8
Mol. Mass.:
700.7756
SMILES:
C[C@H](CNC(=O)c1c(O)c(O)cc2c(O)c(c(C)cc12)-c1c(C)cc2c(C(=O)NC[C@@H](C)c3ccccc3)c(O)c(O)cc2c1O)c1ccccc1
: