Target
Melatonin receptor type 1B
Ligand
BDBM50316692
Substrate
Meas. Tech.
ChEMBL_632471 (CHEMBL1108335)
Ki
6.5±n/a nM
Citation
 Mésangeau, CPérès, BDescamps-François, CChavatte, PAudinot, VCoumailleau, SBoutin, JADelagrange, PBennejean, CRenard, PCaignard, DHBerthelot, PYous, S Design, synthesis and pharmacological evaluation of novel naphthalenic derivatives as selective MT(1) melatoninergic ligands. Bioorg Med Chem 18:3426-36 (2010)  
Target
Name:
Melatonin receptor type 1B
Synonyms:
MTNR1B Mel-1B-R Melatonin 1B Melatonin receptor type 1B | Melatonin receptor type 2 (MT2)
Type:
Enzyme
Mol. Mass.:
40203.54
Organism:
Homo sapiens (Human)
Description:
P49286
Residue:
362
  
Inhibitor
Name:
BDBM50316692
Synonyms:
CHEMBL1094212 | N-[2-(7-{4-(4'-Hydroxymethylbiphenyl-4-yloxy}butoxy)-naphthalen-1-yl)ethyl]acetamide
Type:
Small organic molecule
Emp. Form.:
C31H33NO4
Mol. Mass.:
483.598
SMILES:
CC(=O)NCCc1cccc2ccc(OCCCCOc3ccc(cc3)-c3ccc(CO)cc3)cc12
: