Target
Prolyl endopeptidase
Ligand
BDBM50038879
Substrate
Meas. Tech.
ChEMBL_632273 (CHEMBL1110135)
Ki
0.5±n/a nM
Citation
 Lawandi, JGerber-Lemaire, SJuillerat-Jeanneret, LMoitessier, N Inhibitors of prolyl oligopeptidases for the therapy of human diseases: defining diseases and inhibitors. J Med Chem 53:3423-38 (2010)  
Target
Name:
Prolyl endopeptidase
Synonyms:
PPCE_ELIME | f1pep1
Type:
PROTEIN
Mol. Mass.:
78717.03
Organism:
Flavobacterium meningosepticum
Description:
ChEMBL_632273
Residue:
705
  
Inhibitor
Name:
BDBM50038879
Synonyms:
(S)-2-(2-Formyl-pyrrolidine-1-carbonyl)-pyrrolidine-1-carboxylic acid benzyl ester JTP-4819 | Z-PRO-PROLINAL
Type:
Small organic molecule
Emp. Form.:
C18H22N2O4
Mol. Mass.:
330.3783
SMILES:
O=C[C@@H]1CCCN1C(=O)[C@@H]1CCCN1C(=O)OCc1ccccc1
: