Target
Prolyl endopeptidase
Ligand
BDBM50170682
Substrate
Meas. Tech.
ChEMBL_632259 (CHEMBL1110121)
Ki
0.36±n/a nM
Citation
 Lawandi, JGerber-Lemaire, SJuillerat-Jeanneret, LMoitessier, N Inhibitors of prolyl oligopeptidases for the therapy of human diseases: defining diseases and inhibitors. J Med Chem 53:3423-38 (2010)  
Target
Name:
Prolyl endopeptidase
Synonyms:
3.4.21.26 PPCE_PIG Post-proline cleaving enzyme
Type:
Mol. Mass.:
80758.04
Organism:
Sus scrofa
Description:
Residue:
710
  
Inhibitor
Name:
BDBM50170682
Synonyms:
(S)-1-((S)-1-(3-((S)-2-(cyclopentanecarbonyl)pyrrolidine-1-carbonyl)benzoyl)pyrrolidine-2-carbonyl)pyrrolidine-2-carbonitrile CHEMBL191572
Type:
Small organic molecule
Emp. Form.:
C28H34N4O4
Mol. Mass.:
490.594
SMILES:
O=C(C1CCCC1)[C@@H]1CCCN1C(=O)c1cccc(c1)C(=O)N1CCC[C@H]1C(=O)N1CCC[C@H]1C#N
: