Target
Bombesin receptor subtype-3
Ligand
BDBM50317478
Substrate
Meas. Tech.
ChEMBL_631840 (CHEMBL1111911)
EC50
10000±n/a nM
Citation
 Guo, CGuzzo, PRHadden, MSargent, BJYet, LKan, YPalyha, OKelly, TMGuan, XRosko, KGagen, KMetzger, JMDragovic, JLyons, KLin, LSNargund, RP Synthesis of 7-benzyl-5-(piperidin-1-yl)-6,7,8,9-tetrahydro-3H-pyrazolo[3,4-c][2,7]naphthyridin-1-ylamine and its analogs as bombesin receptor subtype-3 agonists. Bioorg Med Chem Lett 20:2785-9 (2010)  
Target
Name:
Bombesin receptor subtype-3
Synonyms:
BRS-3 BRS3_HUMAN Bombesin like receptor 3
Type:
Enzyme Catalytic Domain
Mol. Mass.:
44424.45
Organism:
Homo sapiens (Human)
Description:
Bombesin 3 BRS3 HUMAN::P32247
Residue:
399
  
Inhibitor
Name:
BDBM50317478
Synonyms:
5-(azocan-1-yl)-7-benzyl-6,7,8,9-tetrahydro-3H-pyrazolo[3,4-c][2,7]naphthyridin-1-amine | CHEMBL1094771
Type:
Small organic molecule
Emp. Form.:
C23H30N6
Mol. Mass.:
390.5245
SMILES:
Nc1n[nH]c2nc(N3CCCCCCC3)c3CN(Cc4ccccc4)CCc3c12
: