Target
DNA topoisomerase 1
Ligand
BDBM7459
Substrate
Meas. Tech.
ChEMBL_631867 (CHEMBL1111938)
IC50
660±n/a nM
Citation
 Wang, POwnby, SZhang, ZYuan, WLi, S Cytotoxicity and inhibition of DNA topoisomerase I of polyhydroxylated triterpenoids and triterpenoid glycosides. Bioorg Med Chem Lett 20:2790-6 (2010)  
Target
Name:
DNA topoisomerase 1
Synonyms:
TOP1_RAT | Top1
Type:
PROTEIN
Mol. Mass.:
90805.96
Organism:
Rattus norvegicus
Description:
ChEMBL_631869
Residue:
767
  
Inhibitor
Name:
BDBM7459
Synonyms:
2-(3,4-dihydroxyphenyl)-5,7-dihydroxy-4H-chromen-4-one CHEMBL151 Luteolin (4) cid_5280445 med.21724, Compound 3
Type:
Small organic molecule
Emp. Form.:
C15H10O6
Mol. Mass.:
286.2363
SMILES:
Oc1cc(O)c2c(c1)oc(cc2=O)-c1ccc(O)c(O)c1
: