Target
Glutamate receptor ionotropic, kainate 1
Ligand
BDBM17657
Substrate
Meas. Tech.
ChEMBL_629330 (CHEMBL1104010)
Ki
140±n/a nM
Citation
 Lolli, MLGiordano, CPickering, DSRolando, BHansen, KBFoti, AContreras-Sanz, AAmir, AFruttero, RGasco, ANielsen, BJohansen, TN 4-hydroxy-1,2,5-oxadiazol-3-yl moiety as bioisoster of the carboxy function. Synthesis, ionization constants, and molecular pharmacological characterization at ionotropic glutamate receptors of compounds related to glutamate and its homologues. J Med Chem 53:4110-8 (2010)  
Target
Name:
Glutamate receptor ionotropic, kainate 1
Synonyms:
GRIK1_RAT Glutamate receptor ionotropic kainate 1 Glutamate receptor, ionotropic kainate 1 Grik1
Type:
Enzyme Catalytic Domain
Mol. Mass.:
107860.82
Organism:
RAT
Description:
P22756
Residue:
949
  
Inhibitor
Name:
BDBM17657
Synonyms:
(2S)-2-aminopentanedioic acid D-Glutamate L-Glu L-Glutamic acid L-gluatmate
Type:
Amino Acid
Emp. Form.:
C5H9NO4
Mol. Mass.:
147.1293
SMILES:
N[C@@H](CCC(O)=O)C(O)=O
: