Target
Glutamate receptor ionotropic, kainate 3
Ligand
BDBM17657
Substrate
Meas. Tech.
ChEMBL_629332 (CHEMBL1104012)
Ki
490±n/a nM
Citation
 Lolli, MLGiordano, CPickering, DSRolando, BHansen, KBFoti, AContreras-Sanz, AAmir, AFruttero, RGasco, ANielsen, BJohansen, TN 4-hydroxy-1,2,5-oxadiazol-3-yl moiety as bioisoster of the carboxy function. Synthesis, ionization constants, and molecular pharmacological characterization at ionotropic glutamate receptors of compounds related to glutamate and its homologues. J Med Chem 53:4110-8 (2010)  
Target
Name:
Glutamate receptor ionotropic, kainate 3
Synonyms:
GRIK3_RAT Glutamate receptor ionotropic kainate 3 Grik3
Type:
PROTEIN
Mol. Mass.:
104080.46
Organism:
Rattus norvegicus
Description:
ChEMBL_1447329
Residue:
919
  
Inhibitor
Name:
BDBM17657
Synonyms:
(2S)-2-aminopentanedioic acid D-Glutamate L-Glu L-Glutamic acid L-gluatmate
Type:
Amino Acid
Emp. Form.:
C5H9NO4
Mol. Mass.:
147.1293
SMILES:
N[C@@H](CCC(O)=O)C(O)=O
: