Target
Transient receptor potential cation channel subfamily A member 1
Ligand
BDBM50327675
Substrate
Meas. Tech.
ChEMBL_633011 (CHEMBL1118236)
EC50
0.0759±n/a nM
Citation
 Baraldi, PGPreti, DMaterazzi, SGeppetti, P Transient receptor potential ankyrin 1 (TRPA1) channel as emerging target for novel analgesics and anti-inflammatory agents. J Med Chem 53:5085-107 (2010)  
Target
Name:
Transient receptor potential cation channel subfamily A member 1
Synonyms:
ANKTM1 TRPA1 Transformation-sensitive protein p120 | Transient receptor potential cation channel subfamily A member 1 (TRPA1)
Type:
Protein
Mol. Mass.:
127514.20
Organism:
Homo sapiens (Human)
Description:
O75762
Residue:
1119
  
Inhibitor
Name:
BDBM50327675
Synonyms:
CHEMBL1084640 dibenzo[b,f][1,4]oxazepine-4-carboxamide
Type:
Small organic molecule
Emp. Form.:
C14H10N2O2
Mol. Mass.:
238.2414
SMILES:
NC(=O)c1cccc2C=Nc3ccccc3Oc12
: