Target
Transient receptor potential cation channel subfamily A member 1
Ligand
BDBM50415923
Substrate
Meas. Tech.
ChEMBL_633011 (CHEMBL1118236)
EC50
0.117±n/a nM
Citation
 Baraldi, PGPreti, DMaterazzi, SGeppetti, P Transient receptor potential ankyrin 1 (TRPA1) channel as emerging target for novel analgesics and anti-inflammatory agents. J Med Chem 53:5085-107 (2010)  
Target
Name:
Transient receptor potential cation channel subfamily A member 1
Synonyms:
ANKTM1 TRPA1 Transformation-sensitive protein p120 | Transient receptor potential cation channel subfamily A member 1 (TRPA1)
Type:
Protein
Mol. Mass.:
127514.20
Organism:
Homo sapiens (Human)
Description:
O75762
Residue:
1119
  
Inhibitor
Name:
BDBM50415923
Synonyms:
CHEMBL1084098
Type:
Small organic molecule
Emp. Form.:
C15H11NO3
Mol. Mass.:
253.2527
SMILES:
COC(=O)c1cccc2N=Cc3ccccc3Oc12
: