Target
Lysosomal acid glucosylceramidase
Ligand
BDBM50318564
Substrate
Meas. Tech.
ChEMBL_633109 (CHEMBL1118492)
IC50
30.2±n/a nM
Citation
 Díaz, LBujons, JCasas, JLlebaria, ADelgado, A Click chemistry approach to new N-substituted aminocyclitols as potential pharmacological chaperones for Gaucher disease. J Med Chem 53:5248-55 (2010)  
Target
Name:
Lysosomal acid glucosylceramidase
Synonyms:
Acid beta-glucosidase Beta-glucocerebrosidase D-glucosyl-N-acylsphingosine glucohydrolase GBA1 GC GLUC Glucosylceramidase (GBA) Glucosylceramidase precursor (Beta-glucocerebrosidase) (Acid beta-glucosidase) (D-glucosyl-N-acylsphingosine glucohydrolase) (Alglucerase) (Imiglucerase) beta-glucocerebrosidase (GCase)
Type:
Enzyme
Mol. Mass.:
59724.64
Organism:
Homo sapiens (Human)
Description:
The beta-Glu activity was measured with commercially available beta-glucocerebrosidase (Ceredase) as the enzyme source.
Residue:
536
  
Inhibitor
Name:
BDBM50318564
Synonyms:
(1R,2S,3r,4R,5S,6s)-6-((1-dodecyl-1H-1,2,3-triazol-4-yl)methylamino)cyclohexane-1,2,3,4,5-pentaol | CHEMBL1084109
Type:
Small organic molecule
Emp. Form.:
C21H40N4O5
Mol. Mass.:
428.5661
SMILES:
CCCCCCCCCCCCn1cc(CN[C@@H]2[C@@H](O)[C@H](O)[C@@H](O)[C@H](O)[C@H]2O)nn1
: