Target
Dynamin-1
Ligand
BDBM50318675
Substrate
Meas. Tech.
ChEMBL_633480 (CHEMBL1119292)
IC50
12900±n/a nM
Citation
 Odell, LRHowan, DGordon, CPRobertson, MJChau, NMariana, AWhiting, AEAbagyan, RDaniel, JAGorgani, NNRobinson, PJMcCluskey, A The pthaladyns: GTP competitive inhibitors of dynamin I and II GTPase derived from virtual screening. J Med Chem 53:5267-80 (2010)  
Target
Name:
Dynamin-1
Synonyms:
DYN1_RAT Dnm1
Type:
PROTEIN
Mol. Mass.:
97296.32
Organism:
Rattus norvegicus
Description:
ChEMBL_633480
Residue:
864
  
Inhibitor
Name:
BDBM50318675
Synonyms:
4-Chloro-2-{[2-(3-nitrophenyl)-1,3-dioxo-2,3-dihydro-1H-isoindole-5-carbonyl]-amino}-benzoic Acid | CHEMBL1084249
Type:
Small organic molecule
Emp. Form.:
C22H12ClN3O7
Mol. Mass.:
465.8
SMILES:
OC(=O)c1ccc(Cl)cc1NC(=O)c1ccc2C(=O)N(C(=O)c2c1)c1cccc(c1)[N+]([O-])=O
: