Target
Acetylcholinesterase
Ligand
BDBM50318703
Substrate
Meas. Tech.
ChEMBL_633736 (CHEMBL1119107)
IC50
120±n/a nM
Citation
 de Los Ríos, CEgea, JMarco-Contelles, JLeón, RSamadi, AIriepa, IMoraleda, IGálvez, EGarcía, AGLópez, MGVillarroya, MRomero, A Synthesis, inhibitory activity of cholinesterases, and neuroprotective profile of novel 1,8-naphthyridine derivatives. J Med Chem 53:5129-43 (2010)  
Target
Name:
Acetylcholinesterase
Synonyms:
ACES_BOVIN Acetylcholinesterase (AChE) | Acetylcholinesterase precursor
Type:
Enzyme
Mol. Mass.:
67659.62
Organism:
Bos taurus (bovine)
Description:
Residue:
613
  
Inhibitor
Name:
BDBM50318703
Synonyms:
CHEMBL1083972 | Methyl 5-Amino-2-methyl-7,8-dihydro-6H-cyclopenta-[b][1,8]naphthyridine-3-carboxylate
Type:
Small organic molecule
Emp. Form.:
C14H15N3O2
Mol. Mass.:
257.2878
SMILES:
COC(=O)c1cc2c(N)c3CCCc3nc2nc1C
: