Target
Polyunsaturated fatty acid lipoxygenase ALOX15
Ligand
BDBM50320447
Substrate
Meas. Tech.
ChEMBL_636738 (CHEMBL1167027)
IC50
5300±n/a nM
Citation
 Robinson, SJHoobler, EKRiener, MLoveridge, STTenney, KValeriote, FAHolman, TRCrews, P Using enzyme assays to evaluate the structure and bioactivity of sponge-derived meroterpenes. J Nat Prod 72:1857-63 (2009)  
Target
Name:
Polyunsaturated fatty acid lipoxygenase ALOX15
Synonyms:
15-Lipoxygenase-1 (15-LOX-1) Arachidonate 15-lipoxygenase LOG15 Reticulocyte 15-lipoxygenase-1 | Sphingosine 1-phosphate receptor 1 (S1P1)
Type:
Protein
Mol. Mass.:
74804.05
Organism:
Homo sapiens (Human)
Description:
Residue:
662
  
Inhibitor
Name:
BDBM50320447
Synonyms:
CHEMBL1164369 | isojaspic acid
Type:
Small organic molecule
Emp. Form.:
C27H38O3
Mol. Mass.:
410.5888
SMILES:
[#6]\[#6](-[#6])=[#6]\[#6]-[#6][C@@]1([#6])[#6]-[#6]-[#6][C@]2([#6])[#6@H](-[#6]-c3cc(ccc3-[#8])-[#6](-[#8])=O)-[#6](-[#6])=[#6]-[#6]-[#6@@H]12
: