Target
Polyunsaturated fatty acid 5-lipoxygenase
Ligand
BDBM50240865
Substrate
Meas. Tech.
ChEMBL_636734 (CHEMBL1167023)
IC50
680±n/a nM
Citation
 Robinson, SJHoobler, EKRiener, MLoveridge, STTenney, KValeriote, FAHolman, TRCrews, P Using enzyme assays to evaluate the structure and bioactivity of sponge-derived meroterpenes. J Nat Prod 72:1857-63 (2009)  
Target
Name:
Polyunsaturated fatty acid 5-lipoxygenase
Synonyms:
5-LO 5-Lipoxygenase (5-LO) 5-Lipoygenase ALOX5 LOG5 | LOX5_HUMAN
Type:
Enzyme
Mol. Mass.:
77972.74
Organism:
Homo sapiens (Human)
Description:
Recombinant protein was purified from E. coli lysate. After ammonium sulfate precipitation and subsequent steps, the supernatant (S100) was used for 5-LO activity assay.
Residue:
674
  
Inhibitor
Name:
BDBM50240865
Synonyms:
(4aS,6aS,12aR,12bS)-10-Hydroxy-4,4,6a,12b-tetramethyl-1,2,3,4,4a,5,6,6a,12a,12b-decahydro-benzo[a]xanthen-9-one PUUPEHENONE
Type:
Small organic molecule
Emp. Form.:
C21H28O3
Mol. Mass.:
328.4452
SMILES:
CC1(C)CCC[C@@]2(C)[C@H]1CC[C@]1(C)OC3=CC(=O)C(=O)CC3=C[C@H]21
: