Target
Orotidine 5'-phosphate decarboxylase
Ligand
BDBM50199178
Substrate
Meas. Tech.
ChEMBL_639015 (CHEMBL1166153)
Temperature
298.15±n/a K
Ki
0.0090±n/a nM
Comments
extracted
Citation
 Meza-Avina, MEWei, LLiu, YPoduch, EBello, AMMishra, RKPai, EFKotra, LP Structural determinants for the inhibitory ligands of orotidine-5'-monophosphate decarboxylase. Bioorg Med Chem 18:4032-41 (2010)  
Target
Name:
Orotidine 5'-phosphate decarboxylase
Synonyms:
Orotidine phosphate decarboxylase URA3
Type:
PROTEIN
Mol. Mass.:
29241.18
Organism:
Saccharomyces cerevisiae
Description:
ChEMBL_639015
Residue:
267
  
Inhibitor
Name:
BDBM50199178
Synonyms:
1-beta-D-ribofuranosyl(3H)pyrimidine-2,4,6-trione 5'-monophosphate 6-HYDROXYURIDINE-5'-PHOSPHATE CHEMBL383923
Type:
Small organic molecule
Emp. Form.:
C9H13N2O10P
Mol. Mass.:
340.1807
SMILES:
O[C@@H]1[C@@H](COP(O)(O)=O)O[C@H]([C@@H]1O)n1c(O)cc(=O)[nH]c1=O
: