Target
Type-2 angiotensin II receptor
Ligand
BDBM50321064
Substrate
Meas. Tech.
ChEMBL_637186 (CHEMBL1167160)
Ki
2.9±n/a nM
Citation
 Mahalingam, AKWan, YMurugaiah, AMWallinder, CWu, XPlouffe, BBotros, MNyberg, FHallberg, AGallo-Payet, NAlterman, M Selective angiotensin II AT(2) receptor agonists with reduced CYP 450 inhibition. Bioorg Med Chem 18:4570-90 (2010)  
Target
Name:
Type-2 angiotensin II receptor
Synonyms:
Angiotensin type II receptor
Type:
PROTEIN
Mol. Mass.:
15474.49
Organism:
Sus scrofa
Description:
ChEMBL_1285617
Residue:
137
  
Inhibitor
Name:
BDBM50321064
Synonyms:
CHEMBL1165175 | N-Butyloxycarbonyl-3-[4-(1-methyl-1H-imidazole-2-carbonyl)-phenyl]-5-iso-butylthiophene-2-sulfonamide
Type:
Small organic molecule
Emp. Form.:
C24H29N3O5S2
Mol. Mass.:
503.634
SMILES:
CCCCOC(=O)NS(=O)(=O)c1sc(CC(C)C)cc1-c1ccc(cc1)C(=O)c1nccn1C
: