Target
Type-2 angiotensin II receptor
Ligand
BDBM50321082
Substrate
Meas. Tech.
ChEMBL_637186 (CHEMBL1167160)
Ki
280±n/a nM
Citation
 Mahalingam, AKWan, YMurugaiah, AMWallinder, CWu, XPlouffe, BBotros, MNyberg, FHallberg, AGallo-Payet, NAlterman, M Selective angiotensin II AT(2) receptor agonists with reduced CYP 450 inhibition. Bioorg Med Chem 18:4570-90 (2010)  
Target
Name:
Type-2 angiotensin II receptor
Synonyms:
Angiotensin type II receptor
Type:
PROTEIN
Mol. Mass.:
15474.49
Organism:
Sus scrofa
Description:
ChEMBL_1285617
Residue:
137
  
Inhibitor
Name:
BDBM50321082
Synonyms:
CHEMBL1164112 | N-Butyloxycarbonyl-3-[4-(thiazolidine-3-ylmethyl)-phenyl]-5-iso-butyl-thiophene-2-sulfonamide
Type:
Small organic molecule
Emp. Form.:
C23H32N2O4S3
Mol. Mass.:
496.706
SMILES:
CCCCOC(=O)NS(=O)(=O)c1sc(CC(C)C)cc1-c1ccc(CN2CCSC2)cc1
: