Target
Mineralocorticoid receptor
Ligand
BDBM50321176
Substrate
Meas. Tech.
ChEMBL_637930 (CHEMBL1166116)
EC50
>10000±n/a nM
Citation
 Du, YLi, QXiong, BHui, XWang, XFeng, YMeng, THu, DZhang, DWang, MShen, J Aromatic beta-amino-ketone derivatives as novel selective non-steroidal progesterone receptor antagonists. Bioorg Med Chem 18:4255-68 (2010)  
Target
Name:
Mineralocorticoid receptor
Synonyms:
MCR MLR NR3C2 | Nuclear receptor subfamily 3 group C member 2
Type:
Enzyme
Mol. Mass.:
107076.42
Organism:
Homo sapiens (Human)
Description:
P08235
Residue:
984
  
Inhibitor
Name:
BDBM50321176
Synonyms:
CHEMBL1163598 | rac-3-(4-Nitrophenylamino)-3-(3-fluorophenyl)-1-p-tolylpropan-1-one
Type:
Small organic molecule
Emp. Form.:
C22H19FN2O3
Mol. Mass.:
378.3963
SMILES:
Cc1ccc(cc1)C(=O)CC(Nc1ccc(cc1)[N+]([O-])=O)c1cccc(F)c1
: