Target
3-phosphoinositide-dependent protein kinase 1
Ligand
BDBM50321379
Substrate
Meas. Tech.
ChEMBL_640311 (CHEMBL1174636)
EC50
187000±n/a nM
Citation
 Wei, LGao, XWarne, RHao, XBussiere, DGu, XJUno, TLiu, Y Design and synthesis of benzoazepin-2-one analogs as allosteric binders targeting the PIF pocket of PDK1. Bioorg Med Chem Lett 20:3897-902 (2010)  
Target
Name:
3-phosphoinositide-dependent protein kinase 1
Synonyms:
3-Phosphoinositide-Dependent Protein Kinase 1 (PDK1) 3-phosphoinositide-dependent protein kinase 1 3-phosphoinositide-dependent protein kinase 1 (PDK-1) Isoform 2 of 3-phosphoinositide-dependent protein kinase 1 PDPK1 Phosphoinositide-dependent protein kinase 1 (PDK1) hPDK1
Type:
Enzyme
Mol. Mass.:
63157.65
Organism:
Homo sapiens (Human)
Description:
O15530
Residue:
556
  
Inhibitor
Name:
BDBM50321379
Synonyms:
4-(1-(carboxymethyl)-2-oxo-2,3,4,5-tetrahydro-1H-benzo[b]azepin-3-ylthio)benzoic acid | CHEMBL1171415
Type:
Small organic molecule
Emp. Form.:
C19H17NO5S
Mol. Mass.:
371.407
SMILES:
OC(=O)CN1c2ccccc2CCC(Sc2ccc(cc2)C(O)=O)C1=O
: