Target
Adenosine receptor A2a
Ligand
BDBM50321527
Substrate
Meas. Tech.
ChEMBL_639629 (CHEMBL1175307)
Ki
3±n/a nM
Citation
 Cheung, AWBrinkman, JFirooznia, FFlohr, AGrimsby, JGubler, MLGuertin, KHamid, RMarcopulos, NNorcross, RDQi, LRamsey, GTan, JWen, YSarabu, R 4-Substituted-7-N-alkyl-N-acetyl 2-aminobenzothiazole amides: drug-like and non-xanthine based A2B adenosine receptor antagonists. Bioorg Med Chem Lett 20:4140-6 (2010)  
Target
Name:
Adenosine receptor A2a
Synonyms:
A2A adenosine receptor (hA2A) ADENOSINE A2 ADORA2 Adenosine A2A receptor (A2AAR)
Type:
G Protein-Coupled Receptor (GPCR)
Mol. Mass.:
44716.46
Organism:
Homo sapiens (Human)
Description:
P29274
Residue:
412
  
Inhibitor
Name:
BDBM50321527
Synonyms:
4-fluoro-N-(7-(N-isobutylacetamido)-4-methoxybenzo[d]thiazol-2-yl)benzamide | CHEMBL1171718
Type:
Small organic molecule
Emp. Form.:
C21H22FN3O3S
Mol. Mass.:
415.481
SMILES:
COc1ccc(N(CC(C)C)C(C)=O)c2sc(NC(=O)c3ccc(F)cc3)nc12
: