Target
Cyclin-dependent kinase 2
Ligand
BDBM50321580
Substrate
Meas. Tech.
ChEMBL_639725 (CHEMBL1175614)
IC50
1±n/a nM
Citation
 Angiolini, MBanfi, PCasale, ECasuscelli, FFiorelli, CSaccardo, MBSilvagni, MZuccotto, F Structure-based optimization of potent PDK1 inhibitors. Bioorg Med Chem Lett 20:4095-9 (2010)  
Target
Name:
Cyclin-dependent kinase 2
Synonyms:
CDK2 CDK2_HUMAN Cell division protein kinase 2 Protein cereblon/Cyclin-dependent kinase 2 | p33 protein kinase
Type:
Enzyme Subunit
Mol. Mass.:
33938.17
Organism:
Homo sapiens (Human)
Description:
P24941
Residue:
298
  
Inhibitor
Name:
BDBM50321580
Synonyms:
1-(3-aminopropyl)-8-(phenylamino)-4,5-dihydro-1H-pyrazolo[4,3-h]quinazoline-3-carboxamide | CHEMBL1171950
Type:
Small organic molecule
Emp. Form.:
C19H21N7O
Mol. Mass.:
363.4163
SMILES:
NCCCn1nc(C(N)=O)c2CCc3cnc(Nc4ccccc4)nc3-c12
: