Target
Thrombopoietin receptor
Ligand
BDBM50321628
Substrate
Meas. Tech.
ChEMBL_639843 (CHEMBL1173858)
EC50
702±n/a nM
Citation
 Antipas, ASBlumberg, LCBrissette, WHBrown, MFCasavant, JMDoty, JLDriscoll, JHarris, TMJones, CSMcCurdy, SPMcElroy, EMitton-Fry, MMunchhof, MJReim, DAReiter, LARipp, SLShavnya, ASmeets, MITrevena, KA Structure-activity relationships and hepatic safety risks of thiazole agonists of the thrombopoietin receptor. Bioorg Med Chem Lett 20:4069-72 (2010)  
Target
Name:
Thrombopoietin receptor
Synonyms:
C-mpl MPL TPO-R TPOR_HUMAN
Type:
PROTEIN
Mol. Mass.:
71243.48
Organism:
Homo sapiens (Human)
Description:
ChEMBL_535587
Residue:
635
  
Inhibitor
Name:
BDBM50321628
Synonyms:
1-(3-chloro-5-(5-fluoro-4-(2-fluoro-3-(trifluoromethyl)phenyl)thiazol-2-ylcarbamoyl)pyridin-2-yl)piperidine-4-carboxylic acid | CHEMBL1171609
Type:
Small organic molecule
Emp. Form.:
C22H16ClF5N4O3S
Mol. Mass.:
546.897
SMILES:
OC(=O)C1CCN(CC1)c1ncc(cc1Cl)C(=O)Nc1nc(c(F)s1)-c1cccc(c1F)C(F)(F)F
: