Target
Thrombopoietin receptor
Ligand
BDBM50321631
Substrate
Meas. Tech.
ChEMBL_639843 (CHEMBL1173858)
EC50
66±n/a nM
Citation
 Antipas, ASBlumberg, LCBrissette, WHBrown, MFCasavant, JMDoty, JLDriscoll, JHarris, TMJones, CSMcCurdy, SPMcElroy, EMitton-Fry, MMunchhof, MJReim, DAReiter, LARipp, SLShavnya, ASmeets, MITrevena, KA Structure-activity relationships and hepatic safety risks of thiazole agonists of the thrombopoietin receptor. Bioorg Med Chem Lett 20:4069-72 (2010)  
Target
Name:
Thrombopoietin receptor
Synonyms:
C-mpl MPL TPO-R TPOR_HUMAN
Type:
PROTEIN
Mol. Mass.:
71243.48
Organism:
Homo sapiens (Human)
Description:
ChEMBL_535587
Residue:
635
  
Inhibitor
Name:
BDBM50321631
Synonyms:
1-(3-chloro-5-(4-(4-fluoro-3-(trifluoromethyl)phenyl)-5-methylthiazol-2-ylcarbamoyl)pyridin-2-yl)piperidine-4-carboxylic acid | CHEMBL1172354
Type:
Small organic molecule
Emp. Form.:
C23H19ClF4N4O3S
Mol. Mass.:
542.934
SMILES:
Cc1sc(NC(=O)c2cnc(N3CCC(CC3)C(O)=O)c(Cl)c2)nc1-c1ccc(F)c(c1)C(F)(F)F
: