Target
Mast/stem cell growth factor receptor Kit
Ligand
BDBM50321893
Substrate
Meas. Tech.
ChEMBL_642164 (CHEMBL1176715)
IC50
<10±n/a nM
Citation
 Khanwelkar, RRChen, GSWang, HCYu, CWHuang, CHLee, OChen, CHHwang, CSKo, CHChou, NTLin, MWWang, LMChen, YCHseu, THChang, CNHsu, HCLin, HCShih, YCChou, SHTseng, HWLiu, CPTu, CMHu, TLTsai, YJChern, JW Synthesis and structure-activity relationship of 6-arylureido-3-pyrrol-2-ylmethylideneindolin-2-one derivatives as potent receptor tyrosine kinase inhibitors. Bioorg Med Chem 18:4674-86 (2011)  
Target
Name:
Mast/stem cell growth factor receptor Kit
Synonyms:
CD117 antigen KIT Mast/stem cell growth factor receptor Kit (cKIT) Proto-oncogene tyrosine-protein kinase Kit Stem cell growth factor receptor Tyrosine-protein kinase Kit c-kit v-kit Hardy-Zuckerman 4 feline sarcoma viral oncogene homolog
Type:
Protein
Mol. Mass.:
109869.37
Organism:
Homo sapiens (Human)
Description:
P10721
Residue:
976
  
Inhibitor
Name:
BDBM50321893
Synonyms:
(Z)-1-[2-Oxo-3-(1H-pyrrol-2-ylmethylene)-2,3-dihydro-1H-indol-6-yl]-3-phenyl-urea | CHEMBL1173482
Type:
Small organic molecule
Emp. Form.:
C20H16N4O2
Mol. Mass.:
344.3666
SMILES:
O=C(Nc1ccccc1)Nc1ccc2\C(=C\c3ccc[nH]3)C(=O)Nc2c1
: