Target
Vascular endothelial growth factor receptor 3
Ligand
BDBM4814
Substrate
Meas. Tech.
ChEMBL_642156 (CHEMBL1176707)
IC50
8.9±n/a nM
Citation
 Khanwelkar, RRChen, GSWang, HCYu, CWHuang, CHLee, OChen, CHHwang, CSKo, CHChou, NTLin, MWWang, LMChen, YCHseu, THChang, CNHsu, HCLin, HCShih, YCChou, SHTseng, HWLiu, CPTu, CMHu, TLTsai, YJChern, JW Synthesis and structure-activity relationship of 6-arylureido-3-pyrrol-2-ylmethylideneindolin-2-one derivatives as potent receptor tyrosine kinase inhibitors. Bioorg Med Chem 18:4674-86 (2011)  
Target
Name:
Vascular endothelial growth factor receptor 3
Synonyms:
FLT-4 Fms-like tyrosine kinase 4 VEGFR-3 VGFR3_HUMAN Vascular endothelial growth factor receptor 3 (VEGFR-3) | Vascular endothelial growth factor receptor 3 (VEGFR3)
Type:
Protein
Mol. Mass.:
152749.58
Organism:
Homo sapiens (Human)
Description:
P35916-2
Residue:
1363
  
Inhibitor
Name:
BDBM4814
Synonyms:
CHEMBL535 N-[2-(diethylamino)ethyl]-5-{[(3Z)-5-fluoro-2-oxo-2,3-dihydro-1H-indol-3-ylidene]methyl}-2,4-dimethyl-1H-pyrrole-3-carboxamide SUNITINIB US10464902, Sunitinib US9914707, SU11248
Type:
Small organic molecule
Emp. Form.:
C22H27FN4O2
Mol. Mass.:
398.4738
SMILES:
CCN(CC)CCNC(=O)c1c(C)[nH]c(\C=C2/C(=O)Nc3ccc(F)cc23)c1C
: