Target
Tissue alpha-L-fucosidase
Ligand
BDBM50321921
Substrate
Meas. Tech.
ChEMBL_642265 (CHEMBL1177145)
IC50
30000±n/a nM
Citation
 Moreno-Clavijo, ECarmona, ATMoreno-Vargas, AJRodríguez-Carvajal, MARobina, I Synthesis and inhibitory activities of novel C-3 substituted azafagomines: a new type of selective inhibitors ofa-L-fucosidases. Bioorg Med Chem 18:4648-60 (2011)  
Target
Name:
Tissue alpha-L-fucosidase
Synonyms:
Alpha-L-fucosidase 1 FUCO_BOVIN
Type:
PROTEIN
Mol. Mass.:
54093.12
Organism:
Bos taurus
Description:
ChEMBL_335897
Residue:
468
  
Inhibitor
Name:
BDBM50321921
Synonyms:
(3S,4S,5R,6S)-3-Hydroxymethyl-6-methylhexahydropyridazine-4,5-diol hydrochloride | CHEMBL1172578
Type:
Small organic molecule
Emp. Form.:
C6H14N2O3
Mol. Mass.:
162.187
SMILES:
C[C@@H]1NN[C@@H](CO)[C@H](O)[C@@H]1O
: