Target
Tissue alpha-L-fucosidase
Ligand
BDBM50321923
Substrate
Meas. Tech.
ChEMBL_642265 (CHEMBL1177145)
IC50
283000±n/a nM
Citation
 Moreno-Clavijo, ECarmona, ATMoreno-Vargas, AJRodríguez-Carvajal, MARobina, I Synthesis and inhibitory activities of novel C-3 substituted azafagomines: a new type of selective inhibitors ofa-L-fucosidases. Bioorg Med Chem 18:4648-60 (2011)  
Target
Name:
Tissue alpha-L-fucosidase
Synonyms:
Alpha-L-fucosidase 1 FUCO_BOVIN
Type:
PROTEIN
Mol. Mass.:
54093.12
Organism:
Bos taurus
Description:
ChEMBL_335897
Residue:
468
  
Inhibitor
Name:
BDBM50321923
Synonyms:
(3S,4S,5R,6S)-3-[((2S)-2-Amino-6-phenyl)propanoylaminomethyl]-6-methylhexahydropyridazine-4,5-diol dihydrochloride | CHEMBL1173307
Type:
Small organic molecule
Emp. Form.:
C15H24N4O3
Mol. Mass.:
308.3761
SMILES:
C[C@@H]1NN[C@@H](CNC(=O)[C@@H](N)Cc2ccccc2)[C@H](O)[C@@H]1O
: