Target
C-C chemokine receptor type 5
Ligand
BDBM50322258
Substrate
Meas. Tech.
ChEMBL_642602 (CHEMBL1176491)
IC50
69±n/a nM
Citation
 Nishizawa, RNishiyama, THisaichi, KHirai, KHabashita, HTakaoka, YTada, HSagawa, KShibayama, SMaeda, KMitsuya, HNakai, HFukushima, DToda, M Discovery of orally available spirodiketopiperazine-based CCR5 antagonists. Bioorg Med Chem 18:5208-23 (2010)  
Target
Name:
C-C chemokine receptor type 5
Synonyms:
C-C CKR-5 CC-CKR-5 CCR5 CCR5_HUMAN CHEMR13 HIV-1 fusion coreceptor
Type:
Enzyme
Mol. Mass.:
40540.21
Organism:
Homo sapiens (Human)
Description:
P51681
Residue:
352
  
Inhibitor
Name:
BDBM50322258
Synonyms:
CHEMBL1171095 | rac-1-[(2E)-2-Butenyl]-3-isobutyl-9-(4-phenoxybenzyl)-1,4,9-triazaspiro[5.5]undecane-2,5-dione hydrochloride
Type:
Small organic molecule
Emp. Form.:
C29H37N3O3
Mol. Mass.:
475.6224
SMILES:
C\C=C\CN1C(=O)C(CC(C)C)NC(=O)C11CCN(Cc2ccc(Oc3ccccc3)cc2)CC1
: