Target
Sodium- and chloride-dependent glycine transporter 2
Ligand
BDBM50322445
Substrate
Meas. Tech.
ChEMBL_643223 (CHEMBL1177034)
EC50
>30000±n/a nM
Citation
 Pinard, EAlanine, AAlberati, DBender, MBorroni, EBourdeaux, PBrom, VBurner, SFischer, HHainzl, DHalm, RHauser, NJolidon, SLengyel, JMarty, HPMeyer, TMoreau, JLMory, RNarquizian, RNettekoven, MNorcross, RDPuellmann, BSchmid, PSchmitt, SStalder, HWermuth, RWettstein, JGZimmerli, D Selective GlyT1 inhibitors: discovery of [4-(3-fluoro-5-trifluoromethylpyridin-2-yl)piperazin-1-yl][5-methanesulfonyl-2-((S)-2,2,2-trifluoro-1-methylethoxy)phenyl]methanone (RG1678), a promising novel medicine to treat schizophrenia. J Med Chem 53:4603-14 (2010)  
Target
Name:
Sodium- and chloride-dependent glycine transporter 2
Synonyms:
GLYT2 NET1 SLC6A5 | Sodium- and chloride-dependent glycine transporter 2
Type:
Enzyme Catalytic Domain
Mol. Mass.:
87438.56
Organism:
Homo sapiens (Human)
Description:
Glycine-2-transporter 0 HUMAN::Q9Y345
Residue:
797
  
Inhibitor
Name:
BDBM50322445
Synonyms:
CHEMBL1172010 | rac-[5-Methanesulfonyl-2-(2,2,2-trifluoro-1-methyl-ethoxy)-phenyl]-[4-(4-methoxy-phenyl)piperazin-1-yl]-methanone
Type:
Small organic molecule
Emp. Form.:
C22H25F3N2O5S
Mol. Mass.:
486.505
SMILES:
COc1ccc(cc1)N1CCN(CC1)C(=O)c1cc(ccc1OC(C)C(F)(F)F)S(C)(=O)=O
: